BDBM50046004 (3-{4-[Cyano-(2-methyl-pyridin-3-yl)-methyl]-piperazin-1-yl}-3-oxo-1-phenyl-propyl)-urea::CHEMBL421204
SMILES Cc1ncccc1C(C#N)N1CCN(CC1)C(=O)CC(NC(N)=O)c1ccccc1
InChI Key InChIKey=HRPYXBODLSBBFG-UHFFFAOYSA-N
Data  1 IC50
  Tab Delimited (TSV)   2D SDfile   Computed 3D by Vconf -m prep SDfile
Find this compound or compounds like it in BindingDB:
Activity Spreadsheet -- Enzyme Inhibition Constant Data from BindingDB
Found 1 hit for monomerid = 50046004
TargetPlatelet-activating factor receptor(Cavia porcellus)
J. Uriach & CíA.
Curated by ChEMBL
LigandPNGBDBM50046004((3-{4-[Cyano-(2-methyl-pyridin-3-yl)-methyl]-piper...)
Affinity DataIC50:  470nM. Assay description: Inhibition of PAF-induced platelet aggregation
In DepthDetails ArticlePubMed