BDBM50046017 (2-Methyl-pyridin-3-yl)-[4-(4,4,4-trifluoro-3-phenyl-butyryl)-piperazin-1-yl]-acetonitrile::CHEMBL103636
SMILES Cc1ncccc1C(C#N)N1CCN(CC1)C(=O)CC(c1ccccc1)C(F)(F)F
InChI Key InChIKey=DJVGGWBBBINHRQ-UHFFFAOYSA-N
Data  1 IC50
  Tab Delimited (TSV)   2D SDfile   Computed 3D by Vconf -m prep SDfile
Find this compound or compounds like it in BindingDB:
Activity Spreadsheet -- Enzyme Inhibition Constant Data from BindingDB
Found 1 hit for monomerid = 50046017
TargetPlatelet-activating factor receptor(Cavia porcellus)
J. Uriach & CíA.
Curated by ChEMBL
LigandPNGBDBM50046017((2-Methyl-pyridin-3-yl)-[4-(4,4,4-trifluoro-3-phen...)
Affinity DataIC50:  12nM. Assay description: In vitro inhibition of PAF-induced platelet aggregation in male rabbits
In DepthDetails ArticlePubMed