BDBM50046020 (3-{4-[Cyano-(2-methyl-pyridin-3-yl)-methyl]-piperazin-1-yl}-3-oxo-1-phenyl-propyl)-carbamic acid benzyl ester::CHEMBL431049
SMILES Cc1ncccc1C(C#N)N1CCN(CC1)C(=O)CC(NC(=O)OCc1ccccc1)c1ccccc1
InChI Key InChIKey=GNVBBCNPKCDRQD-UHFFFAOYSA-N
Data  1 IC50
  Tab Delimited (TSV)   2D SDfile   Computed 3D by Vconf -m prep SDfile
Find this compound or compounds like it in BindingDB:
Activity Spreadsheet -- Enzyme Inhibition Constant Data from BindingDB
Found 1 hit for monomerid = 50046020
TargetPlatelet-activating factor receptor(Cavia porcellus)
J. Uriach & CíA.
Curated by ChEMBL
LigandPNGBDBM50046020((3-{4-[Cyano-(2-methyl-pyridin-3-yl)-methyl]-piper...)
Affinity DataIC50:  22nM. Assay description: Inhibition of PAF-induced platelet aggregation
In DepthDetails ArticlePubMed