BDBM50046022 CHEMBL319229::{4-[3-(Benzyl-methyl-amino)-3-phenyl-propionyl]-piperazin-1-yl}-(2-methyl-pyridin-3-yl)-acetonitrile
SMILES CN(Cc1ccccc1)C(CC(=O)N1CCN(CC1)C(C#N)c1cccnc1C)c1ccccc1
InChI Key InChIKey=NHMDUJNJQYQPNF-UHFFFAOYSA-N
Data  1 IC50
  Tab Delimited (TSV)   2D SDfile   Computed 3D by Vconf -m prep SDfile
Find this compound or compounds like it in BindingDB:
Activity Spreadsheet -- Enzyme Inhibition Constant Data from BindingDB
Found 1 hit for monomerid = 50046022
TargetPlatelet-activating factor receptor(Cavia porcellus)
J. Uriach & CíA.
Curated by ChEMBL
LigandPNGBDBM50046022(CHEMBL319229 | {4-[3-(Benzyl-methyl-amino)-3-pheny...)
Affinity DataIC50:  20nM. Assay description: Inhibition of PAF-induced platelet aggregation
In DepthDetails ArticlePubMed