BDBM50046115 2-[2-(2-{2-[2-[2-(2-Amino-3-carboxy-propionylamino)-hexanoylamino]-3-(1H-indol-3-yl)-propionylamino]-acetylamino}-hexanoylamino)-3-(4-sulfo-phenyl)-propionylamino]-succinic acid(BDNL)::CHEMBL2372780
SMILES CCCC[C@H](NC(=O)CNC(=O)[C@H](Cc1c[nH]c2ccccc12)NC(=O)[C@H](CCCC)NC(=O)[C@H](CC(O)=O)NC(=O)[C@H](Cc1ccccc1)NC)C(=O)N[C@@H](Cc1ccc(cc1)S(O)(=O)=O)C(=O)N[C@@H](CC(O)=O)C(O)=O
InChI Key InChIKey=WYLMHAMNXJBOQW-FVMQRRFMSA-N
Data  1 KI
  Tab Delimited (TSV)   2D SDfile   Computed 3D by Vconf -m prep SDfile
Find this compound or compounds like it in BindingDB:
Activity Spreadsheet -- Enzyme Inhibition Constant Data from BindingDB
Found 1 hit for monomerid = 50046115
TargetGastrin/cholecystokinin type B receptor(Homo sapiens (Human))
University Of Paris
Curated by ChEMBL
LigandPNGBDBM50046115(2-[2-(2-{2-[2-[2-(2-Amino-3-carboxy-propionylamino...)
Affinity DataKi:  1nM. Assay description: Displacement of [3H]pCCK-8 from cholecystokinin type B receptor in guinea pig brain membrane
In DepthDetails ArticlePubMed