BDBM50046374 CHEMBL102216::{1-(4-Fluoro-phenyl)-2-[2-(1-formyl-4-guanidino-butylcarbamoyl)-pyrrolidin-1-yl]-2-oxo-ethyl}-carbamic acid tert-butyl ester
SMILES [#6]C([#6])([#6])[#8]-[#6](=O)-[#7]-[#6@@H](-[#6](=O)-[#7]-1-[#6]-[#6]-[#6]-[#6@H]-1-[#6](=O)-[#7]-[#6@@H](-[#6]-[#6]-[#6]\[#7]=[#6](/[#7])-[#7])-[#6]=O)-c1ccc(F)cc1
InChI Key InChIKey=UNTYULOIKNKYHN-GBESFXJTSA-N
Data  5 IC50
  Tab Delimited (TSV)   2D SDfile   Computed 3D by Vconf -m prep SDfile
Find this compound or compounds like it in BindingDB:
Activity Spreadsheet -- Enzyme Inhibition Constant Data from BindingDB
Found 5 hits for monomerid = 50046374
TargetPlasminogen(Homo sapiens (Human))
Eli Lilly
Curated by ChEMBL
LigandPNGBDBM50046374(CHEMBL102216 | {1-(4-Fluoro-phenyl)-2-[2-(1-formyl...)
Affinity DataIC50:  1.80E+4nM. Assay description: Compound was tested in vitro for inhibitory activity against t-PA (tissue plasminogen activator)
In DepthDetails ArticlePubMed
TargetProthrombin(Homo sapiens (Human))
Eli Lilly
Curated by ChEMBL
LigandPNGBDBM50046374(CHEMBL102216 | {1-(4-Fluoro-phenyl)-2-[2-(1-formyl...)
Affinity DataIC50:  1.60E+3nM. Assay description: Inhibitory activity against thrombin
In DepthDetails ArticlePubMed
TargetCoagulation factor X(Homo sapiens (Human))
Eli Lilly
Curated by ChEMBL
LigandPNGBDBM50046374(CHEMBL102216 | {1-(4-Fluoro-phenyl)-2-[2-(1-formyl...)
Affinity DataIC50:  1.60E+3nM. Assay description: Inhibitory activity against factor Xa
In DepthDetails ArticlePubMed
TargetPlasminogen(Homo sapiens (Human))
Eli Lilly
Curated by ChEMBL
LigandPNGBDBM50046374(CHEMBL102216 | {1-(4-Fluoro-phenyl)-2-[2-(1-formyl...)
Affinity DataIC50:  1.60E+3nM. Assay description: Compound was tested in vitro for inhibitory activity against t-PA (tissue plasminogen activator)
In DepthDetails ArticlePubMed
TargetSerine protease 1(Homo sapiens (Human))
Eli Lilly
Curated by ChEMBL
LigandPNGBDBM50046374(CHEMBL102216 | {1-(4-Fluoro-phenyl)-2-[2-(1-formyl...)
Affinity DataIC50:  1.60E+3nM. Assay description: Inhibitory activity against trypsin
In DepthDetails ArticlePubMed