BDBM50046409 CHEMBL109699::N-{1-Benzyl-2,3-dihydroxy-4-[3-methyl-2-(3-morpholin-4-yl-propionylamino)-butyrylamino]-5-phenyl-pentyl}-3-methyl-2-(3-morpholin-4-yl-propionylamino)-butyramide
SMILES CC(C)[C@H](NC(=O)CCN1CCOCC1)C(=O)N[C@@H](Cc1ccccc1)[C@@H](O)[C@@H](O)[C@H](Cc1ccccc1)NC(=O)[C@H](NC(=O)CCN1CCOCC1)C(C)C
InChI Key InChIKey=YYSVJBQFZVALJK-MYBHTMEMSA-N
Data  1 IC50
  Tab Delimited (TSV)   2D SDfile   Computed 3D by Vconf -m prep SDfile
Find this compound or compounds like it in BindingDB:
Activity Spreadsheet -- Enzyme Inhibition Constant Data from BindingDB
Found 1 hit for monomerid = 50046409
TargetGag-Pol polyprotein [489-587](Human immunodeficiency virus type 1)
Abbott Laboratories
Curated by ChEMBL
LigandPNGBDBM50046409(CHEMBL109699 | N-{1-Benzyl-2,3-dihydroxy-4-[3-meth...)
Affinity DataIC50:  23nM. Assay description: Inhibition of purified recombinant HIV-1 protease in a fluorogenic assay
In DepthDetails ArticlePubMed