BDBM50046506 6-(3,4-Dichloro-benzylsulfanylmethyl)-4-dimethylamino-3,5,10,12,12a-pentahydroxy-1,11-dioxo-1,4,4a,5,5a,6,11,12a-octahydro-naphthacene-2-carboxylic acid amide::CHEMBL338028
SMILES CN(C)[C@H]1C2[C@@H](O)C3[C@@H](CSCc4ccc(Cl)c(Cl)c4)c4cccc(O)c4C(=O)C3C(=O)[C@]2(O)C(=O)C(C(N)=O)C1=O
InChI Key InChIKey=IIWYTNUTSSOFON-HTXDNQPMSA-N
Data  1 IC50
  Tab Delimited (TSV)   2D SDfile   Computed 3D by Vconf -m prep SDfile
Find this compound or compounds like it in BindingDB:
Activity Spreadsheet -- Enzyme Inhibition Constant Data from BindingDB
Found 1 hit for monomerid = 50046506
TargetMultidrug transporter MdfA(Escherichia coli (strain K12))
Tufts University
Curated by ChEMBL
LigandPNGBDBM50046506(6-(3,4-Dichloro-benzylsulfanylmethyl)-4-dimethylam...)
Affinity DataIC50:  5.20E+3nM. Assay description: Inhibition of [3H]tetracycline uptake into everted membrane vesicles, prepared from tetracycline resistant Escherichia coli D1-209
In DepthDetails ArticlePubMed