BDBM50046513 6-Decylsulfanylmethyl-4-dimethylamino-3,5,10,12,12a-pentahydroxy-1,11-dioxo-1,4,4a,5,5a,6,11,12a-octahydro-naphthacene-2-carboxylic acid amide::CHEMBL338688
SMILES CCCCCCCCCCSC[C@@H]1C2[C@H](O)C3[C@H](N(C)C)C(=O)C(C(N)=O)C(=O)[C@@]3(O)C(=O)C2C(=O)c2c(O)cccc12
InChI Key InChIKey=PUWMKDDQNOLVQC-RIIZGACCSA-N
Data  1 IC50
  Tab Delimited (TSV)   2D SDfile   Computed 3D by Vconf -m prep SDfile
Find this compound or compounds like it in BindingDB:
Activity Spreadsheet -- Enzyme Inhibition Constant Data from BindingDB
Found 1 hit for monomerid = 50046513
TargetMultidrug transporter MdfA(Escherichia coli (strain K12))
Tufts University
Curated by ChEMBL
LigandPNGBDBM50046513(6-Decylsulfanylmethyl-4-dimethylamino-3,5,10,12,12...)
Affinity DataIC50:  1.12E+4nM. Assay description: Inhibition of [3H]tetracycline uptake into everted membrane vesicles, prepared from tetracycline resistant Escherichia coli D1-209
In DepthDetails ArticlePubMed