BDBM50046534 CHEMBL3309474
SMILES Nc1nccc(Oc2ccc(cc2F)-n2cc(ccc2=O)C(=O)NCc2ccc(F)cc2)c1Cl
InChI Key InChIKey=GCCALMYGQWFOJR-UHFFFAOYSA-N
Data  2 IC50
  Tab Delimited (TSV)   2D SDfile   Computed 3D by Vconf -m prep SDfile
Find this compound or compounds like it in BindingDB:
Activity Spreadsheet -- Enzyme Inhibition Constant Data from BindingDB
Found 2 hits for monomerid = 50046534
TargetVascular endothelial growth factor receptor 2(Homo sapiens (Human))
Central China Normal University
Curated by ChEMBL
LigandPNGBDBM50046534(CHEMBL3309474)
Affinity DataIC50: >2.50E+4nM. Assay description: Inhibition of recombinant VEGFR2 kinase domain (unknown origin)
In DepthDetails ArticlePubMed
TargetHepatocyte growth factor receptor(Homo sapiens (Human))
Central China Normal University
Curated by ChEMBL
LigandPNGBDBM50046534(CHEMBL3309474)
Affinity DataIC50:  850nM. Assay description: Inhibition of recombinant MET kinase domain (unknown origin)
In DepthDetails ArticlePubMed