BDBM50046554 CHEMBL437656::Tyr-Pro-Ser-Lys-Pro-Asp-c(Cys-Pro-Gly-Ala-Arg-Tyr-Cys)-Ser-Ala-Leu-Arg-His-Tyr-Ile-Asn-Leu-Ile-Thr-Arg-Gln-Arg-Tyr
SMILES CC[C@H](C)[C@H](NC(=O)[C@H](Cc1ccc(O)cc1)NC(=O)[C@H](Cc1c[nH]cn1)NC(=O)[C@H](CCCN=C(N)N)NC(=O)[C@H](CC(C)C)NC(=O)[C@H](C)NC(=O)[C@H](CO)NC(=O)[C@H]1CSSC[C@@H](NC(=O)[C@H](CC(O)=O)NC(=O)[C@H]2CCCN2C(=O)[C@@H](CCCCN)NC(=O)[C@H](CO)NC(=O)[C@@H]2CCCN2C(=O)[C@H](N)Cc2ccc(O)cc2)C(=O)N2CCC[C@@H]2C(=O)NCC(=O)N[C@H](C)C(=O)N[C@@H](CCCN=C(N)N)C(=O)N[C@H](Cc2ccc(O)cc2)C(=O)N1)C(=O)N[C@@H](CC(N)=O)C(=O)N[C@@H](CC(C)C)C(=O)N[C@@H]([C@H](C)CC)C(=O)N[C@@H]([C@@H](C)O)C(=O)N[C@@H](CCCN=C(N)N)C(=O)N[C@@H](CCC(N)=O)C(=O)N[C@@H](CCCN=C(N)N)C(=O)N[C@@H](Cc1ccc(O)cc1)C(O)=O
InChI Key InChIKey=ZNPAWFSOBVFMBL-OWCOAUBRSA-N
Data  2 KI
  Tab Delimited (TSV)   2D SDfile   Computed 3D by Vconf -m prep SDfile
Find this compound or compounds like it in BindingDB:
Activity Spreadsheet -- Enzyme Inhibition Constant Data from BindingDB
Found 2 hits for monomerid = 50046554
TargetNeuropeptide Y receptor type 2(Homo sapiens (Human))
Salk Institute
Curated by ChEMBL
LigandPNGBDBM50046554(CHEMBL437656 | Tyr-Pro-Ser-Lys-Pro-Asp-c(Cys-Pro-G...)
Affinity DataKi:  1.30nM. Assay description: Tested against neuropeptide Y2 receptors using SK-N-BE2 human neuroblastoma cells
In DepthDetails ArticlePubMed
TargetNeuropeptide Y receptor type 1(Homo sapiens (Human))
Salk Institute
Curated by ChEMBL
LigandPNGBDBM50046554(CHEMBL437656 | Tyr-Pro-Ser-Lys-Pro-Asp-c(Cys-Pro-G...)
Affinity DataKi:  5.10nM. Assay description: Tested against neuropeptide Y1 receptors using SK-N-MC human neuroblastoma cells
In DepthDetails ArticlePubMed