BDBM50046983 2,2-Dimethyl-propionic acid 1,4-bis-(3,4,5-trimethoxy-benzoyl)-piperazin-2-ylmethyl ester::CHEMBL268596
SMILES COc1cc(cc(OC)c1OC)C(=O)N1CCN(C(COC(=O)C(C)(C)C)C1)C(=O)c1cc(OC)c(OC)c(OC)c1
InChI Key InChIKey=BXIGZIXGNMVVFJ-UHFFFAOYSA-N
Data  2 IC50  1 EC50
  Tab Delimited (TSV)   2D SDfile   Computed 3D by Vconf -m prep SDfile
Find this compound or compounds like it in BindingDB:
Activity Spreadsheet -- Enzyme Inhibition Constant Data from BindingDB
Found 3 hits for monomerid = 50046983
TargetPlatelet-activating factor receptor(Cavia porcellus)
Universit£
Curated by ChEMBL
LigandPNGBDBM50046983(2,2-Dimethyl-propionic acid 1,4-bis-(3,4,5-trimeth...)
Affinity DataIC50:  100nM. Assay description: Inhibition of PAF-induced rabbit platelet aggregation
In DepthDetails ArticlePubMed
TargetPlatelet-activating factor receptor(Cavia porcellus)
Universit£
Curated by ChEMBL
LigandPNGBDBM50046983(2,2-Dimethyl-propionic acid 1,4-bis-(3,4,5-trimeth...)
Affinity DataIC50:  100nM. Assay description: Inhibition of PAF-induced rabbit platelet aggregation
In DepthDetails ArticlePubMed
TargetPlatelet-activating factor receptor(Cavia porcellus)
Universit£
Curated by ChEMBL
LigandPNGBDBM50046983(2,2-Dimethyl-propionic acid 1,4-bis-(3,4,5-trimeth...)
Affinity DataEC50:  300nM. Assay description: Inhibition of [3H]PAF binding to rabbit platelet membrane
In DepthDetails ArticlePubMed