BDBM50047081 4-[6-Chloro-3-(4-methylsulfanyl-benzyl)-3H-imidazo[4,5-b]pyridin-2-yl]-3,3-dimethyl-butyric acid::CHEMBL279348
SMILES CSc1ccc(Cn2c(CC(C)(C)CC(O)=O)nc3cc(Cl)cnc23)cc1
InChI Key InChIKey=RXQUMYDQKWIOQS-UHFFFAOYSA-N
Data  1 KI
  Tab Delimited (TSV)   2D SDfile   Computed 3D by Vconf -m prep SDfile
Find this compound or compounds like it in BindingDB:
Activity Spreadsheet -- Enzyme Inhibition Constant Data from BindingDB
Found 1 hit for monomerid = 50047081
TargetThromboxane A2 receptor(Homo sapiens (Human))
Carpibem
Curated by ChEMBL
LigandPNGBDBM50047081(4-[6-Chloro-3-(4-methylsulfanyl-benzyl)-3H-imidazo...)
Affinity DataKi:  7nM. Assay description: Tested in vitro for inhibition constant against TXA2 / PGH-2 receptor using [125I]-PTA-OH binding affinity to human platelets
In DepthDetails ArticlePubMed