BDBM50047108 2-{2-[4-(6-Fluoro-1H-indol-3-ylmethyl)-piperidin-1-yl]-ethyl}-2H-naphtho[1,8-cd]isothiazole 1,1-dioxide::CHEMBL19267
SMILES Fc1ccc2c(CC3CCN(CCN4c5cccc6cccc(c56)S4(=O)=O)CC3)c[nH]c2c1
InChI Key InChIKey=DREONVGEOAPMOI-UHFFFAOYSA-N
Data  2 IC50
  Tab Delimited (TSV)   2D SDfile   Computed 3D by Vconf -m prep SDfile
Find this compound or compounds like it in BindingDB:
Activity Spreadsheet -- Enzyme Inhibition Constant Data from BindingDB
Found 2 hits for monomerid = 50047108
TargetSodium-dependent serotonin transporter(Rattus norvegicus (rat))
Centre De Recherches De Vitry-Alfortville
Curated by ChEMBL
LigandPNGBDBM50047108(2-{2-[4-(6-Fluoro-1H-indol-3-ylmethyl)-piperidin-1...)
Affinity DataIC50:  0.300nM. Assay description: Inhibition of [3H]-peroxitine binding to rat cortical membranes as measure of inhibitory activity towards 5-HT uptake
In DepthDetails ArticlePubMed
TargetD(2) dopamine receptor(Rattus norvegicus (rat))
Centre De Recherches De Vitry-Alfortville
Curated by ChEMBL
LigandPNGBDBM50047108(2-{2-[4-(6-Fluoro-1H-indol-3-ylmethyl)-piperidin-1...)
Affinity DataIC50:  31nM. Assay description: Binding affinity at dopamine receptor D2 by the inhibition of binding to [3H]-spiperone in rat striatal membranes
In DepthDetails ArticlePubMed