BDBM50047116 2,3,6-Trimethyl-4-[2'-(1H-tetrazol-5-yl)-biphenyl-4-ylmethoxy]-pyridine::CHEMBL22387
SMILES Cc1cc(OCc2ccc(cc2)-c2ccccc2-c2nnn[nH]2)c(C)c(C)n1
InChI Key InChIKey=BOLGXKCIKRIVNY-UHFFFAOYSA-N
Data  1 IC50
  Tab Delimited (TSV)   2D SDfile   Computed 3D by Vconf -m prep SDfile
Find this compound or compounds like it in BindingDB:
Activity Spreadsheet -- Enzyme Inhibition Constant Data from BindingDB
Found 1 hit for monomerid = 50047116
TargetType-1 angiotensin II receptor(Cavia porcellus)
Zeneca Pharmaceuticals
Curated by ChEMBL
LigandPNGBDBM50047116(2,3,6-Trimethyl-4-[2'-(1H-tetrazol-5-yl)-biphenyl-...)
Affinity DataIC50:  130nM. Assay description: Inhibition of [125I]-Angiotensin binding to a guinea pig adrenal membrane preparation which corresponds to Angiotensin II receptor, type 1
In DepthDetails ArticlePubMed