BDBM50047121 6-Methyl-2-propyl-4-[2'-(1H-tetrazol-5-yl)-biphenyl-4-ylmethoxy]-nicotinic acid methyl ester::CHEMBL22692
SMILES CCCc1nc(C)cc(OCc2ccc(cc2)-c2ccccc2-c2nnn[nH]2)c1C(=O)OC
InChI Key InChIKey=QYIWQDZBBVGRJX-UHFFFAOYSA-N
Data  1 IC50
  Tab Delimited (TSV)   2D SDfile   Computed 3D by Vconf -m prep SDfile
Find this compound or compounds like it in BindingDB:
Activity Spreadsheet -- Enzyme Inhibition Constant Data from BindingDB
Found 1 hit for monomerid = 50047121
TargetType-1 angiotensin II receptor(Cavia porcellus)
Zeneca Pharmaceuticals
Curated by ChEMBL
LigandPNGBDBM50047121(6-Methyl-2-propyl-4-[2'-(1H-tetrazol-5-yl)-bipheny...)
Affinity DataIC50:  54nM. Assay description: Inhibition of [125I]-Angiotensin binding to a guinea pig adrenal membrane preparation which corresponds to Angiotensin II receptor, type 1
In DepthDetails ArticlePubMed