BDBM50047146 CHEMBL25013::N-(5,7-Dimethyl-4,6,6a,7,8,9,10,10a-octahydro-indolo[4,3-fg]quinolin-9-yl)-2,2-dimethyl-propionamide::SDZ-208-911
SMILES CN1C[C@H](CC2[C@H]1Cc1c(C)[nH]c3cccc2c13)NC(=O)C(C)(C)C
InChI Key InChIKey=ZNMWUMGOSWLWOH-HDUJFRAXSA-N
Data  3 KI
  Tab Delimited (TSV)   2D SDfile   Computed 3D by Vconf -m prep SDfile
Find this compound or compounds like it in BindingDB:
Activity Spreadsheet -- Enzyme Inhibition Constant Data from BindingDB
Found 3 hits for monomerid = 50047146
TargetD(2) dopamine receptor(Rattus norvegicus (rat))
Upjohn Laboratories
Curated by ChEMBL
LigandPNGBDBM50047146(CHEMBL25013 | N-(5,7-Dimethyl-4,6,6a,7,8,9,10,10a-...)
Affinity DataKi:  0.740nM. Assay description: Compound was tested for antagonistic activity against D2 receptor from rat striatum, used [3H]raclopride as radioligand
In DepthDetails ArticlePubMed
TargetD(2) dopamine receptor(Homo sapiens (Human))
Upjohn Laboratories
Curated by ChEMBL
LigandPNGBDBM50047146(CHEMBL25013 | N-(5,7-Dimethyl-4,6,6a,7,8,9,10,10a-...)
Affinity DataKi:  3.10nM. Assay description: Compound was tested for agonistic activity against D2 receptor from cloned CHO cells, used [3H]U-86170 as radioligand
In DepthDetails ArticlePubMed
Target5-hydroxytryptamine receptor 1A(Homo sapiens (Human))
Upjohn Laboratories
Curated by ChEMBL
LigandPNGBDBM50047146(CHEMBL25013 | N-(5,7-Dimethyl-4,6,6a,7,8,9,10,10a-...)
Affinity DataKi:  19nM. Assay description: Binding affinity against 5-hydroxytryptamine 1A receptor from bovine hippocampus, used [3H]8-OH-DPAT as radioligand
In DepthDetails ArticlePubMed