BDBM50047208 1,3,7-Trimethyl-8-[2-(2,3,4-trimethoxy-phenyl)-vinyl]-3,7-dihydro-purine-2,6-dione::CHEMBL26887
SMILES COc1ccc(\C=C\c2nc3n(C)c(=O)n(C)c(=O)c3n2C)c(OC)c1OC
InChI Key InChIKey=UJGDBYAMGXASBC-CSKARUKUSA-N
Data  2 KI
  Tab Delimited (TSV)   2D SDfile   Computed 3D by Vconf -m prep SDfile
Find this compound or compounds like it in BindingDB:
Activity Spreadsheet -- Enzyme Inhibition Constant Data from BindingDB
Found 2 hits for monomerid = 50047208
TargetAdenosine receptor A2a/A2b(Rattus norvegicus)
National Institute Of Diabetes
Curated by ChEMBL
LigandPNGBDBM50047208(1,3,7-Trimethyl-8-[2-(2,3,4-trimethoxy-phenyl)-vin...)
Affinity DataKi:  206nM. Assay description: Binding affinity against adenosine A2 receptor in rat brain using [3H]- CGS 21680 as radioligand
In DepthDetails ArticlePubMed
TargetAdenosine receptor A1(Rattus norvegicus (rat))
National Institute Of Diabetes
Curated by ChEMBL
LigandPNGBDBM50047208(1,3,7-Trimethyl-8-[2-(2,3,4-trimethoxy-phenyl)-vin...)
Affinity DataKi:  6.92E+3nM. Assay description: Affinity against Adenosine A1 receptor in rat brain using [3H]- PIA as radioligand
In DepthDetails ArticlePubMed