BDBM50047818 CHEMBL347513::N-[4-(3-Benzyl-5-propylsulfanyl-[1,2,4]triazol-4-ylmethyl)-phenyl]-phthalamic acid
SMILES CCCSc1nnc(Cc2ccccc2)n1Cc1ccc(NC(=O)c2ccccc2C(O)=O)cc1
InChI Key InChIKey=FKVSAFVBRJTDFF-UHFFFAOYSA-N
Data  2 IC50
  Tab Delimited (TSV)   2D SDfile   Computed 3D by Vconf -m prep SDfile
Find this compound or compounds like it in BindingDB:
Activity Spreadsheet -- Enzyme Inhibition Constant Data from BindingDB
Found 2 hits for monomerid = 50047818
LigandPNGBDBM50047818(CHEMBL347513 | N-[4-(3-Benzyl-5-propylsulfanyl-[1,...)
Affinity DataIC50:  320nM. Assay description: Antagonist activity at AT1 receptor in Oryctolagus cuniculus (rabbit) aorta
In DepthDetails Article
LigandPNGBDBM50047818(CHEMBL347513 | N-[4-(3-Benzyl-5-propylsulfanyl-[1,...)
Affinity DataIC50:  380nM. Assay description: Displacement of [125I]-Sar1-Ile8-A II at the rabbit aorta angiotensin II receptor, type 1
In DepthDetails ArticlePubMed