BDBM50047829 CHEMBL347236::{5-Butyl-4-[2'-(1H-tetrazol-5-yl)-biphenyl-4-ylmethyl]-4H-[1,2,4]triazol-3-yl}-(4-chloro-benzyl)-amine
SMILES CCCCc1nnc(NCc2ccc(Cl)cc2)n1Cc1ccc(cc1)-c1ccccc1-c1nnn[nH]1
InChI Key InChIKey=ISXIRPGRBKREOK-UHFFFAOYSA-N
Data  1 IC50
  Tab Delimited (TSV)   2D SDfile   Computed 3D by Vconf -m prep SDfile
Find this compound or compounds like it in BindingDB:
Activity Spreadsheet -- Enzyme Inhibition Constant Data from BindingDB
Found 1 hit for monomerid = 50047829
TargetType-1 angiotensin II receptor(RABBIT)
Merck Research Laboratories
Curated by ChEMBL
LigandPNGBDBM50047829(CHEMBL347236 | {5-Butyl-4-[2'-(1H-tetrazol-5-yl)-b...)
Affinity DataIC50:  140nM. Assay description: Displacement of [125I]-Sar1-Ile8-A II at the rabbit aorta angiotensin II receptor, type 1
In DepthDetails ArticlePubMed