BDBM50047842 CHEMBL156084::N-{4-[3-Butyl-5-(2-methyl-benzylsulfanyl)-[1,2,4]triazol-4-ylmethyl]-phenyl}-phthalamic acid
SMILES CCCCc1nnc(SCc2ccccc2C)n1Cc1ccc(NC(=O)c2ccccc2C(O)=O)cc1
InChI Key InChIKey=KOSBNNTYXSDXNA-UHFFFAOYSA-N
Data  2 IC50
  Tab Delimited (TSV)   2D SDfile   Computed 3D by Vconf -m prep SDfile
Find this compound or compounds like it in BindingDB:
Activity Spreadsheet -- Enzyme Inhibition Constant Data from BindingDB
Found 2 hits for monomerid = 50047842
LigandPNGBDBM50047842(CHEMBL156084 | N-{4-[3-Butyl-5-(2-methyl-benzylsul...)
Affinity DataIC50:  14nM. Assay description: Antagonist activity at AT1 receptor in Oryctolagus cuniculus (rabbit) aorta
In DepthDetails Article
LigandPNGBDBM50047842(CHEMBL156084 | N-{4-[3-Butyl-5-(2-methyl-benzylsul...)
Affinity DataIC50:  14nM. Assay description: Displacement of [125I]-Sar1-Ile8-A II at the rabbit aorta angiotensin II receptor, type 1
In DepthDetails ArticlePubMed