BDBM50047881 4-Hydroxy-7-methyl-[1,8]naphthyridine-3-carboxylic acid 8-methyl-8-aza-bicyclo[3.2.1]oct-3-yl ester::CHEMBL435232
SMILES CN1C2CCC1CC(C2)OC(=O)c1cnc2nc(C)ccc2c1O
InChI Key InChIKey=WMURKFAEZXXMDJ-UHFFFAOYSA-N
Data  1 KI
  Tab Delimited (TSV)   2D SDfile   Computed 3D by Vconf -m prep SDfile
Find this compound or compounds like it in BindingDB:
Activity Spreadsheet -- Enzyme Inhibition Constant Data from BindingDB
Found 1 hit for monomerid = 50047881
Target5-hydroxytryptamine receptor 3A/3B(Rattus norvegicus)
Kyowa Hakko Kogyo
Curated by ChEMBL
LigandPNGBDBM50047881(4-Hydroxy-7-methyl-[1,8]naphthyridine-3-carboxylic...)
Affinity DataKi: >100nM. Assay description: Binding affinity against radioligand [3H]quipazine labeled 5-hydroxytryptamine 3 receptor sites in neuroblastoma-glioma (NG108-15) cells.
In DepthDetails ArticlePubMed