BDBM50047939 1-(1-{4-[2-Butyl-4-chloro-5-(2-methoxycarbonyl-ethyl)-imidazol-1-ylmethyl]-phenylcarbamoyl}-2-phenyl-ethyl)-1H-pyrrole-2-carboxylic acid methyl ester::CHEMBL295311
SMILES CCCCc1nc(Cl)c(CCC(=O)OC)n1Cc1ccc(NC(=O)[C@H](Cc2ccccc2)n2cccc2C(=O)OC)cc1
InChI Key InChIKey=CRQSRGYHEVIVBI-NDEPHWFRSA-N
Data  1 IC50
  Tab Delimited (TSV)   2D SDfile   Computed 3D by Vconf -m prep SDfile
Find this compound or compounds like it in BindingDB:
Activity Spreadsheet -- Enzyme Inhibition Constant Data from BindingDB
Found 1 hit for monomerid = 50047939
TargetType-1 angiotensin II receptor B(RAT)
Warner-Lambert
Curated by ChEMBL
LigandPNGBDBM50047939(1-(1-{4-[2-Butyl-4-chloro-5-(2-methoxycarbonyl-eth...)
Affinity DataIC50:  210nM. Assay description: Binding affinity against angiotensin II receptor type 1 (AT1) from rat liver.
In DepthDetails ArticlePubMed