BDBM50048118 2-({1-[2-{[11-[5-Guanidino-2-(2-methylamino-acetylamino)-pentanoylamino]-8-(4-hydroxy-benzyl)-7,10-dioxo-1,2-dithia-6,9-diaza-cyclotridecane-5-carbonyl]-amino}-3-(3H-imidazol-4-yl)-propionyl]-pyrrolidine-2-carbonyl}-amino)-3-phenyl-propionic acid::CHEMBL264450
SMILES CNCC(=O)N[C@@H](CCCNC(N)=N)C(=O)N[C@@H]1CCSSCC[C@@H](NC(=O)[C@@H](Cc2ccc(O)cc2)NC1=O)C(=O)N[C@@H](Cc1cnc[nH]1)C(=O)N1CCC[C@@H]1C(=O)N[C@@H](Cc1ccccc1)C(O)=O
InChI Key InChIKey=VUJKZLLQFJUYIG-VZQVFHNMSA-N
Data  2 IC50
  Tab Delimited (TSV)   2D SDfile   Computed 3D by Vconf -m prep SDfile
Find this compound or compounds like it in BindingDB:
Activity Spreadsheet -- Enzyme Inhibition Constant Data from BindingDB
Found 2 hits for monomerid = 50048118
TargetType-1 angiotensin II receptor A/B(RAT)
Washington University
Curated by ChEMBL
LigandPNGBDBM50048118(2-({1-[2-{[11-[5-Guanidino-2-(2-methylamino-acetyl...)
Affinity DataIC50:  1.30nM. Assay description: In vitro binding affinity to the angiotensin II receptor, type 1 in rat liver
In DepthDetails ArticlePubMed
TargetType-2 angiotensin II receptor(Homo sapiens (Human))
Washington University
Curated by ChEMBL
LigandPNGBDBM50048118(2-({1-[2-{[11-[5-Guanidino-2-(2-methylamino-acetyl...)
Affinity DataIC50:  80nM. Assay description: In vitro binding affinity at angiotensin II (type 2) receptor in rabbit uterus.
In DepthDetails ArticlePubMed