BDBM50048119 CHEMBL385283::c[Sar1-Arg2-Hcy3-Tyr4-MPt5-His6-Pro7-Phe8]
SMILES CNCC(=O)N[C@@H](CCCNC(N)=N)C(=O)N[C@H]1CCSS[C@@H]2C[C@H](N(C2)C(=O)[C@H](Cc2ccc(O)cc2)NC1=O)C(=O)N[C@@H](Cc1cnc[nH]1)C(=O)N1CCC[C@H]1C(=O)N[C@@H](Cc1ccccc1)C(O)=O
InChI Key InChIKey=MZBJHWJCYUAEBH-LTGHFUFGSA-N
Data  2 IC50
  Tab Delimited (TSV)   2D SDfile   Computed 3D by Vconf -m prep SDfile
Find this compound or compounds like it in BindingDB:
Activity Spreadsheet -- Enzyme Inhibition Constant Data from BindingDB
Found 2 hits for monomerid = 50048119
TargetType-1 angiotensin II receptor A/B(RAT)
Washington University
Curated by ChEMBL
LigandPNGBDBM50048119(CHEMBL385283 | c[Sar1-Arg2-Hcy3-Tyr4-MPt5-His6-Pro...)
Affinity DataIC50:  1.30nM. Assay description: In vitro binding affinity to the angiotensin II receptor, type 1 in rat liver
In DepthDetails ArticlePubMed
TargetType-2 angiotensin II receptor(Homo sapiens (Human))
Washington University
Curated by ChEMBL
LigandPNGBDBM50048119(CHEMBL385283 | c[Sar1-Arg2-Hcy3-Tyr4-MPt5-His6-Pro...)
Affinity DataIC50:  0.650nM. Assay description: In vitro binding affinity at angiotensin II (type 2) receptor in rabbit uterus.
In DepthDetails ArticlePubMed