BDBM50048131 Angiotensin I::CHEMBL3144487
SMILES CC[C@H](C)[C@H](NC(=O)[C@@H](NC[C@@H](NC(=O)[C@H](CCCNC(N)=N)NC(=O)[C@@H](N)CC(O)=O)C(C)C)c1ccc(O)cc1)C(=O)N[C@@H](Cc1c[nH]cn1)C(=O)N1CCC[C@H]1C(=O)N[C@@H](Cc1ccccc1)C(=O)N[C@@H](Cc1c[nH]cn1)C(=O)C(N)[C@H](CC(C)C)C(C)=O
InChI Key InChIKey=AZSXKTYFSLKNEF-UHFFFAOYSA-N
Data  2 IC50
  Tab Delimited (TSV)   2D SDfile   Computed 3D by Vconf -m prep SDfile
Find this compound or compounds like it in BindingDB:
Activity Spreadsheet -- Enzyme Inhibition Constant Data from BindingDB
Found 2 hits for monomerid = 50048131
TargetType-1 angiotensin II receptor A/B(RAT)
Washington University
Curated by ChEMBL
LigandPNGBDBM50048131(Angiotensin I | CHEMBL3144487)
Affinity DataIC50:  300nM. Assay description: In vitro binding affinity to the angiotensin II receptor, type 1 in rat liver
In DepthDetails ArticlePubMed
TargetType-2 angiotensin II receptor(Homo sapiens (Human))
Washington University
Curated by ChEMBL
LigandPNGBDBM50048131(Angiotensin I | CHEMBL3144487)
Affinity DataIC50:  116nM. Assay description: In vitro binding affinity at angiotensin II (type 2) receptor in rabbit uterus.
In DepthDetails ArticlePubMed