BDBM50048256 CHEMBL3310769
SMILES Oc1nc(SCc2cccc(F)c2F)nc(-c2ccccc2)c1C#N
InChI Key InChIKey=KQZBOUOJJPVBKW-UHFFFAOYSA-N
Data  1 IC50
  Tab Delimited (TSV)   2D SDfile   Computed 3D by Vconf -m prep SDfile
Find this compound or compounds like it in BindingDB:
Activity Spreadsheet -- Enzyme Inhibition Constant Data from BindingDB
Found 1 hit for monomerid = 50048256
TargetC-X-C chemokine receptor type 2(Homo sapiens (Human))
Novartis Institutes For Biomedical Research
Curated by ChEMBL
LigandPNGBDBM50048256(CHEMBL3310769)
Affinity DataIC50:  3.70E+3nM. Assay description: Antagonist activity against human recombinant CXCR2 receptor expressed in CHO cell membranes by SPA based [35S]GTPgammaS binding assay
In DepthDetails ArticlePubMed