BDBM50048372 CHEMBL3309269
SMILES Nc1nc2c3ccc(cc3nc(Cc3ccc4OCOc4c3)n2n1)C(=O)NCCCO
InChI Key InChIKey=MBNCTAZUUZKCMD-UHFFFAOYSA-N
Data  1 KI
  Tab Delimited (TSV)   2D SDfile   Computed 3D by Vconf -m prep SDfile
Find this compound or compounds like it in BindingDB:
Activity Spreadsheet -- Enzyme Inhibition Constant Data from BindingDB
Found 1 hit for monomerid = 50048372
TargetHeat shock protein HSP 90-beta(Homo sapiens (Human))
Nerviano Medical Sciences
Curated by ChEMBL
LigandPNGBDBM50048372(CHEMBL3309269)
Affinity DataKi:  34nM. Assay description: Inhibition of Hsp90 (unknown origin) by FP displacement assay
In DepthDetails ArticlePubMed