BDBM50048420 CHEMBL3315082
SMILES COc1ccc(C(=O)Cc2c(Cl)cncc2Cl)c(OCC(O)=O)c1OC
InChI Key InChIKey=BHSKOINIMXXGFJ-UHFFFAOYSA-N
Data  1 IC50
  Tab Delimited (TSV)   2D SDfile   Computed 3D by Vconf -m prep SDfile
Find this compound or compounds like it in BindingDB:
Activity Spreadsheet -- Enzyme Inhibition Constant Data from BindingDB
Found 1 hit for monomerid = 50048420
TargetcAMP-specific 3',5'-cyclic phosphodiesterase 4D(Homo sapiens (Human))
Leo Pharma
Curated by ChEMBL
LigandPNGBDBM50048420(CHEMBL3315082)
Affinity DataIC50:  3.76E+3nM. Assay description: Inhibition of human recombinant PDE4D after 1 hr by SPA in presence of radioactively labeled cAMP
In DepthDetails ArticlePubMed