BDBM50048457 4-Hydroxy-3-methylsulfanyl-4,5,6,7-tetrahydro-benzo[c]thiophene-1-carboxylic acid ethyl ester::CHEMBL337243
SMILES CCOC(=O)c1sc(SC)c2C(O)CCCc12
InChI Key InChIKey=RBCWUWDOOSYVAH-UHFFFAOYSA-N
Data  4 KI
  Tab Delimited (TSV)   2D SDfile   Computed 3D by Vconf -m prep SDfile
Find this compound or compounds like it in BindingDB:
Activity Spreadsheet -- Enzyme Inhibition Constant Data from BindingDB
Found 4 hits for monomerid = 50048457
TargetAdenosine receptor A3(Rattus norvegicus)
National Institute Of Diabetes
Curated by ChEMBL
LigandPNGBDBM50048457(4-Hydroxy-3-methylsulfanyl-4,5,6,7-tetrahydro-benz...)
Affinity DataKi:  1.54E+4nM. Assay description: Displacement of [125I]-AB-MECA from rat Adenosine A3 receptor expressed in CHO cell membrane
In DepthDetails ArticlePubMed
TargetAdenosine receptor A1(Rattus norvegicus (rat))
National Institute Of Diabetes
Curated by ChEMBL
LigandPNGBDBM50048457(4-Hydroxy-3-methylsulfanyl-4,5,6,7-tetrahydro-benz...)
Affinity DataKi:  1.83E+4nM. Assay description: Tested for the displacement [3H]-PIA from Adenosine A1 receptor in rat brain membrane
In DepthDetails ArticlePubMed
TargetAdenosine receptor A2a(Rattus norvegicus (rat))
National Institute Of Diabetes
Curated by ChEMBL
LigandPNGBDBM50048457(4-Hydroxy-3-methylsulfanyl-4,5,6,7-tetrahydro-benz...)
Affinity DataKi:  3.35E+4nM. Assay description: Displacement [3H]-CGS-21,680 from Adenosine A2A receptor in rat striatal membrane.
In DepthDetails ArticlePubMed
TargetAdenosine receptor A3(Homo sapiens (Human))
National Institute Of Diabetes
Curated by ChEMBL
LigandPNGBDBM50048457(4-Hydroxy-3-methylsulfanyl-4,5,6,7-tetrahydro-benz...)
Affinity DataKi:  3.58E+4nM. Assay description: Displacement of [125I]-AB-MECA from human Adenosine A3 receptor expressed in HEK-293 cell membrane
In DepthDetails ArticlePubMed