BDBM50048550 CHEMBL3310005
SMILES Cc1ccc(cc1)[C@H]1CC(=NN1C(=O)c1ccccc1)c1cc(Cl)ccc1O
InChI Key InChIKey=CQBBSZUVCQFFIZ-OAQYLSRUSA-N
Data  2 KI
  Tab Delimited (TSV)   2D SDfile   Computed 3D by Vconf -m prep SDfile
Find this compound or compounds like it in BindingDB:
Activity Spreadsheet -- Enzyme Inhibition Constant Data from BindingDB
Found 2 hits for monomerid = 50048550
TargetAmine oxidase [flavin-containing] A(Homo sapiens (Human))
Ministry Of Health Of Turkey
Curated by ChEMBL
LigandPNGBDBM50048550(CHEMBL3310005)
Affinity DataKi:  12nM. Assay description: Inhibition of human MAOA expressed in baculovirus-infected BTI insect cells assessed as H2O2 production by resorufin dye based fluorimetric method
In DepthDetails ArticlePubMed
TargetAmine oxidase [flavin-containing] B(Homo sapiens (Human))
Ministry Of Health Of Turkey
Curated by ChEMBL
LigandPNGBDBM50048550(CHEMBL3310005)
Affinity DataKi:  750nM. Assay description: Inhibition of human MAOB expressed in baculovirus-infected BTI insect cells assessed as H2O2 production by resorufin dye based fluorimetric method
In DepthDetails ArticlePubMed