BDBM50048616 CHEMBL3310029
SMILES COc1ccc(cc1)\C(\C=C\c1ccc(C)cc1)=N/NC(=O)c1snnc1C
InChI Key InChIKey=OZUZYCMRXPIBJC-VBYNVFIDSA-N
Data  2 KI
  Tab Delimited (TSV)   2D SDfile   Computed 3D by Vconf -m prep SDfile
Find this compound or compounds like it in BindingDB:
Activity Spreadsheet -- Enzyme Inhibition Constant Data from BindingDB
Found 2 hits for monomerid = 50048616
TargetAmine oxidase [flavin-containing] A(Homo sapiens (Human))
Ministry Of Health Of Turkey
Curated by ChEMBL
LigandPNGBDBM50048616(CHEMBL3310029)
Affinity DataKi:  41nM. Assay description: Inhibition of human MAOA expressed in baculovirus-infected BTI insect cells assessed as H2O2 production by resorufin dye based fluorimetric method
In DepthDetails ArticlePubMed
TargetAmine oxidase [flavin-containing] B(Homo sapiens (Human))
Ministry Of Health Of Turkey
Curated by ChEMBL
LigandPNGBDBM50048616(CHEMBL3310029)
Affinity DataKi:  900nM. Assay description: Inhibition of human MAOB expressed in baculovirus-infected BTI insect cells assessed as H2O2 production by resorufin dye based fluorimetric method
In DepthDetails ArticlePubMed