BDBM50048628 CHEMBL3319633
SMILES CC1(C)CCc2cc(ccc2O1)S(=O)(=O)N(CCOC(=O)N1CCCCC1)Cc1cccc(Oc2ccccc2)c1
InChI Key InChIKey=OTKJSPAEOWOKQG-UHFFFAOYSA-N
Data  1 IC50
  Tab Delimited (TSV)   2D SDfile   Computed 3D by Vconf -m prep SDfile
Find this compound or compounds like it in BindingDB:
Activity Spreadsheet -- Enzyme Inhibition Constant Data from BindingDB
Found 1 hit for monomerid = 50048628
TargetDiacylglycerol lipase-alpha(Homo sapiens (Human))
Leiden University
Curated by ChEMBL
LigandPNGBDBM50048628(CHEMBL3319633)
Affinity DataIC50: >1.00E+4nM. Assay description: Inhibition of human DAGLalpha expressed in HEK293T cell membranes
In DepthDetails ArticlePubMed