BDBM50048953 4'-((R)-2-Amino-3-mercapto-propylamino)-biphenyl-3-carboxylic acid::4'-(2-Amino-3-mercapto-propylamino)-biphenyl-3-carboxylic acid 4(FTI-265)::CHEMBL417600
SMILES N[C@@H](CS)CNc1ccc(cc1)-c1cccc(c1)C(O)=O
InChI Key InChIKey=GVHAKJDMTSSDKK-CQSZACIVSA-N
Data  6 IC50
  Tab Delimited (TSV)   2D SDfile   Computed 3D by Vconf -m prep SDfile
Find this compound or compounds like it in BindingDB:
Activity Spreadsheet -- Enzyme Inhibition Constant Data from BindingDB
Found 6 hits for monomerid = 50048953
TargetDimer of Protein farnesyltransferase subunit beta(Homo sapiens (Human))
Yale University
Curated by ChEMBL
LigandPNGBDBM50048953(4'-((R)-2-Amino-3-mercapto-propylamino)-biphenyl-3...)
Affinity DataIC50:  150nM. Assay description: Inhibition of farnesyltransferase from human Burkitt lymphoma (Daudi) cells
In DepthDetails ArticlePubMed
LigandPNGBDBM50048953(4'-((R)-2-Amino-3-mercapto-propylamino)-biphenyl-3...)
Affinity DataIC50:  9.00E+4nM. Assay description: Inhibition of partially purified Geranylgeranyl transferase type I (GGTase-I) from human Burkitt lymphoma (Daudi) cells
In DepthDetails ArticlePubMed
LigandPNGBDBM50048953(4'-((R)-2-Amino-3-mercapto-propylamino)-biphenyl-3...)
Affinity DataIC50:  1.00E+5nM. Assay description: Activity against Geranylgeranyl transferase type I
In DepthDetails ArticlePubMed
LigandPNGBDBM50048953(4'-((R)-2-Amino-3-mercapto-propylamino)-biphenyl-3...)
Affinity DataIC50:  1.00E+5nM. Assay description: In vitro inhibition of Geranylgeranyl transferase type I
In DepthDetails ArticlePubMed
LigandPNGBDBM50048953(4'-((R)-2-Amino-3-mercapto-propylamino)-biphenyl-3...)
Affinity DataIC50:  50nM. Assay description: Activity against rat brain Farnesyltransferase
In DepthDetails ArticlePubMed
TargetProtein farnesyltransferase subunit beta/geranylgeranyltransferase type-1 subunit alpha(Homo sapiens (Human))
University Of Pittsburgh
Curated by ChEMBL
LigandPNGBDBM50048953(4'-((R)-2-Amino-3-mercapto-propylamino)-biphenyl-3...)
Affinity DataIC50:  114nM. Assay description: In vitro inhibition of Farnesyltransferase
In DepthDetails ArticlePubMed