BDBM50049066 2-Hydroxynaphthoquinone::CHEBI:44401::Lawsone::NSC-8625
SMILES OC1=CC(=O)c2ccccc2C1=O
InChI Key InChIKey=CSFWPUWCSPOLJW-UHFFFAOYSA-N
Data  6 IC50
PDB links: 1 PDB ID matches this monomer.
  Tab Delimited (TSV)   2D SDfile   Computed 3D by Vconf -m prep SDfile
Find this compound or compounds like it in BindingDB:
Activity Spreadsheet -- Enzyme Inhibition Constant Data from BindingDB
Found 6 hits for monomerid = 50049066
TargetTyrosine-protein phosphatase non-receptor type 22(Homo sapiens (Human))
University Of Utah
Curated by ChEMBL
LigandPNGBDBM50049066(2-Hydroxynaphthoquinone | CHEBI:44401 | Lawsone | ...)
Affinity DataIC50:  5.60E+3nM. Assay description: Inhibition of LYP (unknown origin) using DiFMUP substrate incubated for 2 hrs
In DepthDetails ArticlePubMed
TargetP2X purinoceptor 7(Mus musculus)
Instituto Oswaldo Cruz
Curated by ChEMBL
LigandPNGBDBM50049066(2-Hydroxynaphthoquinone | CHEBI:44401 | Lawsone | ...)
Affinity DataIC50:  7.55E+4nM. Assay description: Antagonist activity at P2X7R in Swiss Webster mouse peritoneal macrophages assessed as inhibition of ATP-induced propidium iodide uptake preincubated...
In DepthDetails ArticlePubMed
TargetCysteine protease(Trypanosoma brucei rhodesiense)
Federal University Of Alagoas
Curated by ChEMBL
LigandPNGBDBM50049066(2-Hydroxynaphthoquinone | CHEBI:44401 | Lawsone | ...)
Affinity DataIC50: >1.00E+5nM. Assay description: Inhibition of recombinant Trypanosoma brucei rhodesain using Z-FR-AMC as substrate by fluorimetric analysis relative to control
In DepthDetails ArticlePubMed
TargetHistone-lysine N-methyltransferase SETD7(Homo sapiens (Human))
University Of Chinese Academy Of Sciences
Curated by ChEMBL
LigandPNGBDBM50049066(2-Hydroxynaphthoquinone | CHEBI:44401 | Lawsone | ...)
Affinity DataIC50: >2.00E+5nM. Assay description: Inhibition of SET7 (unknown origin) using biotinylated histone polypeptide as substrate in presence of SAM by AlphaLISA assay
In DepthDetails ArticlePubMed
TargetCysteine protease(Trypanosoma brucei rhodesiense)
Federal University Of Alagoas
Curated by ChEMBL
LigandPNGBDBM50049066(2-Hydroxynaphthoquinone | CHEBI:44401 | Lawsone | ...)
Affinity DataIC50:  3.30E+4nM. Assay description: Inhibition of recombinant Trypanosoma brucei rhodesain using Z-FR-AMC as substrate preincubated for 10 mins followed by substrate addition measured f...
In DepthDetails ArticlePubMed
TargetDihydroorotate dehydrogenase (quinone), mitochondrial(Schistosoma mansoni)
Universidade De S£O Paulo
Curated by ChEMBL
LigandPNGBDBM50049066(2-Hydroxynaphthoquinone | CHEBI:44401 | Lawsone | ...)
Affinity DataIC50:  2.90E+4nM. Assay description: Inhibition of Schistosoma mansoni DHODH using DHO as substrate measured at 4 secs interval for 60 secs by DCIP reduction based indirect assay
In DepthDetails ArticlePubMed