BDBM50049117 3-(2'-Carboxy-biphenyl-4-ylmethyl)-2-ethyl-5-(1-hydroxy-1-methyl-ethyl)-3H-imidazole-4-carboxylic acid::CHEMBL114527
SMILES CCc1nc(c(C(O)=O)n1Cc1ccc(cc1)-c1ccccc1C(O)=O)C(C)(C)O
InChI Key InChIKey=QQFSFXONJOTGRX-UHFFFAOYSA-N
Data  1 IC50
  Tab Delimited (TSV)   2D SDfile   Computed 3D by Vconf -m prep SDfile
Find this compound or compounds like it in BindingDB:
Activity Spreadsheet -- Enzyme Inhibition Constant Data from BindingDB
Found 1 hit for monomerid = 50049117
TargetType-1 angiotensin II receptor(Bos taurus)
Sankyo
Curated by ChEMBL
LigandPNGBDBM50049117(3-(2'-Carboxy-biphenyl-4-ylmethyl)-2-ethyl-5-(1-hy...)
Affinity DataIC50:  37nM. Assay description: In vitro for inhibition of [125I]-angiotensin II (0.1 nM) binding to angiotensin II receptor type 1 in membrane fractions of bovine adrenal cortex
In DepthDetails ArticlePubMed