BDBM50049176 (R)-2-((S)-4-Carboxy-4-{4-[(2,7-dimethyl-4-oxo-3,4-dihydro-quinazolin-6-ylmethyl)-methyl-amino]-2-fluoro-benzoylamino}-butyrylamino)-pentanedioic acid; TFA::CHEMBL168952
SMILES CN(Cc1cc2c(cc1C)nc(C)[nH]c2=O)c1ccc(C(=O)N[C@@H](CCC(=O)N[C@H](CCC(O)=O)C(O)=O)C(O)=O)c(F)c1
InChI Key InChIKey=WLXRGPPKLQUTDZ-YADHBBJMSA-N
Data  1 IC50
  Tab Delimited (TSV)   2D SDfile   Computed 3D by Vconf -m prep SDfile
Find this compound or compounds like it in BindingDB:
Activity Spreadsheet -- Enzyme Inhibition Constant Data from BindingDB
Found 1 hit for monomerid = 50049176
TargetThymidylate synthase(Mus musculus)
Institute Of Cancer Research
Curated by ChEMBL
LigandPNGBDBM50049176((R)-2-((S)-4-Carboxy-4-{4-[(2,7-dimethyl-4-oxo-3,4...)
Affinity DataIC50:  2nM. Assay description: Inhibition of Thymidylate synthase activity in L1210 cells
In DepthDetails ArticlePubMed