BDBM50049232 CHEMBL348349::Tetrasodium salt of 4-(4'-Methyl-biphenyl-4-yl)-1-phosphono-butane-1-sulfonic acid
SMILES [#6]\[#6](-[#6])=[#6]\[#6]-[#6]\[#6](-[#6])=[#6]\[#6]-[#6]-[#6]-[#6](P([#8-])([#8-])=O)P([#8-])([#8-])=O
InChI Key InChIKey=ISMDHWZGHKZNRH-XYOKQWHBSA-J
Data  1 IC50
  Tab Delimited (TSV)   2D SDfile   Computed 3D by Vconf -m prep SDfile
Find this compound or compounds like it in BindingDB:
Activity Spreadsheet -- Enzyme Inhibition Constant Data from BindingDB
Found 1 hit for monomerid = 50049232
TargetSqualene synthase(Rattus norvegicus)
Bristol-Myers Squibb Pharmaceutical Research Institute
Curated by ChEMBL
LigandPNGBDBM50049232(CHEMBL348349 | Tetrasodium salt of 4-(4'-Methyl-bi...)
Affinity DataIC50:  1nM. Assay description: Inhibitory activity against rat liver microsomal squalene synthase was determined using [3H]-FPP as radioligand
In DepthDetails ArticlePubMed