BDBM50049396 5-Hydroxy-2-(4-methoxy-phenyl)-7-methyl-chromen-4-one::CHEMBL148826
SMILES COc1ccc(cc1)-c1cc(=O)c2c(O)cc(C)cc2o1
InChI Key InChIKey=BSEYWXDBSOCPQP-UHFFFAOYSA-N
Data  6 KI
  Tab Delimited (TSV)   2D SDfile   Computed 3D by Vconf -m prep SDfile
Find this compound or compounds like it in BindingDB:
Activity Spreadsheet -- Enzyme Inhibition Constant Data from BindingDB
Found 6 hits for monomerid = 50049396
TargetAdenosine receptor A1(Rattus norvegicus (rat))
National Institute Of Diabetes
Curated by ChEMBL
LigandPNGBDBM50049396(5-Hydroxy-2-(4-methoxy-phenyl)-7-methyl-chromen-4-...)
Affinity DataKi:  3.39E+3nM. Assay description: Ability to displace [3H]N6-phenylisopropyladenosine binding from adenosine A1 receptor.Checked by Author
In DepthDetails ArticlePubMed
TargetAdenosine receptor A1(Rattus norvegicus (rat))
National Institute Of Diabetes
Curated by ChEMBL
LigandPNGBDBM50049396(5-Hydroxy-2-(4-methoxy-phenyl)-7-methyl-chromen-4-...)
Affinity DataKi:  3.40E+3nM. Assay description: Displacement of specific [3H]-PIA binding from adenosine A1 receptor in rat brain membranes.
In DepthDetails ArticlePubMed
TargetAdenosine receptor A3(Homo sapiens (Human))
National Institute Of Diabetes
Curated by ChEMBL
LigandPNGBDBM50049396(5-Hydroxy-2-(4-methoxy-phenyl)-7-methyl-chromen-4-...)
Affinity DataKi:  6.70E+3nM. Assay description: Displacement of [125I]-AB-MECA binding to human Adenosine A3 receptor expressed in HEK-293 cells
In DepthDetails ArticlePubMed
TargetAdenosine receptor A2a(Rattus norvegicus (rat))
National Institute Of Diabetes
Curated by ChEMBL
LigandPNGBDBM50049396(5-Hydroxy-2-(4-methoxy-phenyl)-7-methyl-chromen-4-...)
Affinity DataKi:  2.80E+4nM. Assay description: Affinity at Adenosine A2A receptor in rat striatal membranes by [3H]- CGS 21680 displacement.
In DepthDetails ArticlePubMed
TargetAdenosine receptor A2a(Rattus norvegicus (rat))
National Institute Of Diabetes
Curated by ChEMBL
LigandPNGBDBM50049396(5-Hydroxy-2-(4-methoxy-phenyl)-7-methyl-chromen-4-...)
Affinity DataKi:  2.82E+4nM. Assay description: Ability to displace [3H]-CGS- 21680 binding from adenosine A2A receptor.Checked by Author
In DepthDetails ArticlePubMed
TargetAdenosine receptor A3(Homo sapiens (Human))
National Institute Of Diabetes
Curated by ChEMBL
LigandPNGBDBM50049396(5-Hydroxy-2-(4-methoxy-phenyl)-7-methyl-chromen-4-...)
Affinity DataKi:  5.01E+4nM. Assay description: Ability to displace [125I]-AB-MECA binding from adenosine A3 receptor.Checked by Author
In DepthDetails ArticlePubMed