BDBM50049544 CHEMBL3317487
SMILES CC(C(=O)NCc1ccc(nc1-c1ccoc1)C(F)(F)F)c1ccc(NS(C)(=O)=O)c(F)c1
InChI Key InChIKey=YMXYRAPJKALAMN-UHFFFAOYSA-N
Data  1 KI
  Tab Delimited (TSV)   2D SDfile   Computed 3D by Vconf -m prep SDfile
Find this compound or compounds like it in BindingDB:
Activity Spreadsheet -- Enzyme Inhibition Constant Data from BindingDB
Found 1 hit for monomerid = 50049544
TargetTransient receptor potential cation channel subfamily V member 1(Homo sapiens (Human))
Seoul National University
Curated by ChEMBL
LigandPNGBDBM50049544(CHEMBL3317487)
Affinity DataKi:  1.40nM. Assay description: Antagonist activity against human TRPV1 expressed in CHO cells assessed as inhibition of capsaicin-induced channel activation by FLIPR assay
In DepthDetails ArticlePubMed