BDBM50049614 6-[(3-Chloro-phenylamino)-methyl]-pyrido[3,2-d]pyrimidine-2,4-diamine::CHEMBL54618
SMILES Nc1nc(N)c2nc(CNc3cccc(Cl)c3)ccc2n1
InChI Key InChIKey=UYTSDXNCTIAVMW-UHFFFAOYSA-N
Data  6 IC50
  Tab Delimited (TSV)   2D SDfile   Computed 3D by Vconf -m prep SDfile
Find this compound or compounds like it in BindingDB:
Activity Spreadsheet -- Enzyme Inhibition Constant Data from BindingDB
Found 6 hits for monomerid = 50049614
TargetDihydrofolate reductase(Saccharomyces cerevisiae)
Duquesne University
Curated by ChEMBL
LigandPNGBDBM50049614(6-[(3-Chloro-phenylamino)-methyl]-pyrido[3,2-d]pyr...)
Affinity DataIC50:  2.00E+3nM. Assay description: Inhibitory activity against Pneumocystis carinii dihydrofolate reductase.
In DepthDetails ArticlePubMed
TargetDihydrofolate reductase(Rattus norvegicus (rat))
Duquesne University
Curated by ChEMBL
LigandPNGBDBM50049614(6-[(3-Chloro-phenylamino)-methyl]-pyrido[3,2-d]pyr...)
Affinity DataIC50:  140nM. Assay description: Inhibitory activity against rat liver dihydrofolate reductase.
In DepthDetails ArticlePubMed
TargetDihydrofolate reductase(Pneumocystis carinii)
Duquesne University
Curated by ChEMBL
LigandPNGBDBM50049614(6-[(3-Chloro-phenylamino)-methyl]-pyrido[3,2-d]pyr...)
Affinity DataIC50:  2.00E+3nM. Assay description: Inhibition of Pneumocystis carinii dihydrofolate reductase
In DepthDetails ArticlePubMed
TargetBifunctional dihydrofolate reductase-thymidylate synthase(Toxoplasma gondii)
Duquesne University
Curated by ChEMBL
LigandPNGBDBM50049614(6-[(3-Chloro-phenylamino)-methyl]-pyrido[3,2-d]pyr...)
Affinity DataIC50:  130nM. Assay description: Inhibition of Toxoplasma gondii dihydrofolate reductase
In DepthDetails ArticlePubMed
TargetDihydrofolate reductase(Rattus norvegicus (rat))
Duquesne University
Curated by ChEMBL
LigandPNGBDBM50049614(6-[(3-Chloro-phenylamino)-methyl]-pyrido[3,2-d]pyr...)
Affinity DataIC50:  140nM. Assay description: Inhibition of rat liver dihydrofolate reductase
In DepthDetails ArticlePubMed
TargetBifunctional dihydrofolate reductase-thymidylate synthase(Toxoplasma gondii)
Duquesne University
Curated by ChEMBL
LigandPNGBDBM50049614(6-[(3-Chloro-phenylamino)-methyl]-pyrido[3,2-d]pyr...)
Affinity DataIC50:  130nM. Assay description: Inhibitory activity against Toxoplasma gondii dihydrofolate reductase.
In DepthDetails ArticlePubMed