BDBM50049800 CHEMBL3322010
SMILES CC(C)[C@H](N)C(=O)N[C@@H](CCCNC(N)=N)C(=O)N1CCC[C@H]1C(O)=O
InChI Key InChIKey=CVUDMNSZAIZFAE-SRVKXCTJSA-N
Data  1 IC50
  Tab Delimited (TSV)   2D SDfile   Computed 3D by Vconf -m prep SDfile
Find this compound or compounds like it in BindingDB:
Activity Spreadsheet -- Enzyme Inhibition Constant Data from BindingDB
Found 1 hit for monomerid = 50049800
TargetAngiotensin-converting enzyme(Homo sapiens (Human))
Tianjin University
Curated by ChEMBL
LigandPNGBDBM50049800(CHEMBL3322010)
Affinity DataIC50:  2.18E+6nM. Assay description: Inhibition of ACE (unknown origin)
In DepthDetails ArticlePubMed