BDBM50049867 CHEMBL3322293
SMILES [O-][n+]1onc(COc2ccc3CCN4C(CN(CC4=O)C(=O)C4CCCCC4)c3c2)c1C#N
InChI Key InChIKey=USGBXUIDXFKZJM-UHFFFAOYSA-N
Data  1 IC50
  Tab Delimited (TSV)   2D SDfile   Computed 3D by Vconf -m prep SDfile
Find this compound or compounds like it in BindingDB:
Activity Spreadsheet -- Enzyme Inhibition Constant Data from BindingDB
Found 1 hit for monomerid = 50049867
TargetThioredoxin glutathione reductase(Schistosoma mansoni)
Universit£
Curated by ChEMBL
LigandPNGBDBM50049867(CHEMBL3322293)
Affinity DataIC50:  350nM. Assay description: Inhibition of Schistosoma mansoni recombinant thioredoxin glutathione reductase assessed as 5-thio-2nitrobezoic acid formation after 3 mins
In DepthDetails ArticlePubMed