BDBM50049899 7-Isopropyl-8-methyl-7H-pyrrolo[3,2-f]quinazoline-1,3-diamine::CHEMBL173617::TCMDC-137864
SMILES CC(C)n1c(C)cc2c1ccc1nc(N)nc(N)c21
InChI Key InChIKey=WTYUZEFAFVALJC-UHFFFAOYSA-N
Data  2 KI
  Tab Delimited (TSV)   2D SDfile   Computed 3D by Vconf -m prep SDfile
Find this compound or compounds like it in BindingDB:
Activity Spreadsheet -- Enzyme Inhibition Constant Data from BindingDB
Found 2 hits for monomerid = 50049899
TargetDihydrofolate reductase(Candida albicans)
Wellcome Research Laboratories
Curated by ChEMBL
LigandPNGBDBM50049899(7-Isopropyl-8-methyl-7H-pyrrolo[3,2-f]quinazoline-...)
Affinity DataKi:  0.220nM. Assay description: Inhibition of Dihydrofolate reductase enzyme from Candida albicans
In DepthDetails ArticlePubMed
TargetDihydrofolate reductase(Homo sapiens (Human))
Wellcome Research Laboratories
Curated by ChEMBL
LigandPNGBDBM50049899(7-Isopropyl-8-methyl-7H-pyrrolo[3,2-f]quinazoline-...)
Affinity DataKi:  6.40nM. Assay description: Inhibition of human recombinant Dihydrofolate reductase enzyme
In DepthDetails ArticlePubMed