BDBM50050093 (4-Chloro-6-methoxy-2-methyl-pyrimidin-5-yl)-imidazolidin-2-ylidene-amine::2-(4-Chloro-6-methoxy-2-methyl-pyrimidin-5-ylamino)-4,5-dihydro-3H-imidazol-1-ium::CHEMBL19236::MOXONIDINE
SMILES [#6]-[#8]-c1nc(-[#6])nc(Cl)c1\[#7]=[#6]-1\[#7]-[#6]-[#6]-[#7]-1
InChI Key InChIKey=WPNJAUFVNXKLIM-UHFFFAOYSA-N
Data  8 KI  1 IC50
  Tab Delimited (TSV)   2D SDfile   Computed 3D by Vconf -m prep SDfile
Find this compound or compounds like it in BindingDB:
Activity Spreadsheet -- Enzyme Inhibition Constant Data from BindingDB
Found 9 hits for monomerid = 50050093
TargetNischarin(Homo sapiens (Human))
University Of Belgrade
Curated by ChEMBL
LigandPNGBDBM50050093((4-Chloro-6-methoxy-2-methyl-pyrimidin-5-yl)-imida...)
Affinity DataKi:  4.20nM. Assay description: Displacement of [125I]PIC from human imidazoline receptor 1 in human platelets analyzed under norepinephrine mask of alpha 2AR
In DepthDetails ArticlePubMed
TargetNischarin(Homo sapiens (Human))
University Of Belgrade
Curated by ChEMBL
LigandPNGBDBM50050093((4-Chloro-6-methoxy-2-methyl-pyrimidin-5-yl)-imida...)
Affinity DataKi:  56nM. Assay description: Displacement of [3H]-clonidine from bovine imidazoline receptor I-1
In DepthDetails ArticlePubMed
TargetAlpha-2A/Alpha-2B/Alpha-2C adrenergic receptor(Homo sapiens (Human))
Universit£
Curated by ChEMBL
LigandPNGBDBM50050093((4-Chloro-6-methoxy-2-methyl-pyrimidin-5-yl)-imida...)
Affinity DataKi:  75nM. Assay description: Displacement of [3H]RX821002 from human alpha2 adrenoceptor expressed in CHO cell membranes after 60 mins
In DepthDetails ArticlePubMed
TargetNischarin(RAT)
Universit£
Curated by ChEMBL
LigandPNGBDBM50050093((4-Chloro-6-methoxy-2-methyl-pyrimidin-5-yl)-imida...)
Affinity DataKi:  78nM. Assay description: Displacement of [125I] PIC from I1 imidazoline receptor in rat PC12 cells after 45 mins by gamma counting
In DepthDetails ArticlePubMed
TargetAlpha-2A adrenergic receptor(Homo sapiens (Human))
Allergan
Curated by ChEMBL
LigandPNGBDBM50050093((4-Chloro-6-methoxy-2-methyl-pyrimidin-5-yl)-imida...)
Affinity DataKi:  150nM. Assay description: Binding affinity for human Alpha-2A adrenergic receptor
In DepthDetails ArticlePubMed
TargetAlpha-2B adrenergic receptor(NEONATAL RAT)
Allergan
Curated by ChEMBL
LigandPNGBDBM50050093((4-Chloro-6-methoxy-2-methyl-pyrimidin-5-yl)-imida...)
Affinity DataKi:  1.00E+3nM. Assay description: Binding affinity for rat Alpha-2B adrenergic receptor
In DepthDetails ArticlePubMed
TargetAlpha-2C adrenergic receptor(Homo sapiens (Human))
Allergan
Curated by ChEMBL
LigandPNGBDBM50050093((4-Chloro-6-methoxy-2-methyl-pyrimidin-5-yl)-imida...)
Affinity DataKi:  2.00E+3nM. Assay description: Binding affinity for human Alpha-2C adrenergic receptor
In DepthDetails ArticlePubMed
TargetNischarin(RAT)
Universit£
Curated by ChEMBL
LigandPNGBDBM50050093((4-Chloro-6-methoxy-2-methyl-pyrimidin-5-yl)-imida...)
Affinity DataKi: >1.00E+4nM
In DepthDetails PubMed
TargetNischarin(Homo sapiens (Human))
University Of Belgrade
Curated by ChEMBL
LigandPNGBDBM50050093((4-Chloro-6-methoxy-2-methyl-pyrimidin-5-yl)-imida...)
Affinity DataIC50:  3.5nM. Assay description: Displacement of [3H]clonidine from I1IR in human brain frontal cortex in presence of adrenaline incubated for 45 mins by liquid scintillation spectro...
In DepthDetails ArticlePubMed