BDBM50050187 CHEMBL22112::[Dioctylamino]-sulfonyl]-carbamicacid 2,6-di-isopropyl-phenylester
SMILES CCCCCCCCN(CCCCCCCC)S(=O)(=O)NC(=O)Oc1c(cccc1C(C)C)C(C)C
InChI Key InChIKey=HQGVRKOMAQRXHE-UHFFFAOYSA-N
Data  1 IC50
  Tab Delimited (TSV)   2D SDfile   Computed 3D by Vconf -m prep SDfile
Find this compound or compounds like it in BindingDB:
Activity Spreadsheet -- Enzyme Inhibition Constant Data from BindingDB
Found 1 hit for monomerid = 50050187
TargetSterol O-acyltransferase 1(Rattus norvegicus)
Warner-Lambert
Curated by ChEMBL
LigandPNGBDBM50050187(CHEMBL22112 | [Dioctylamino]-sulfonyl]-carbamicaci...)
Affinity DataIC50:  5.80E+4nM. Assay description: In vitro inhibitory activity against acyl coenzyme A:cholesterol acyltransferase 1 in microsomes of rat liver
In DepthDetails ArticlePubMed