BDBM50050243 CHEMBL21586::N'-[2,6-Bis(1-methylethyl)phenyl]-N-[(diethylamino)sulfonyl]urea
SMILES CCN(CC)S(=O)(=O)NC(=O)Nc1c(cccc1C(C)C)C(C)C
InChI Key InChIKey=UKGNNUUHKFDIDX-UHFFFAOYSA-N
Data  1 IC50
  Tab Delimited (TSV)   2D SDfile   Computed 3D by Vconf -m prep SDfile
Find this compound or compounds like it in BindingDB:
Activity Spreadsheet -- Enzyme Inhibition Constant Data from BindingDB
Found 1 hit for monomerid = 50050243
TargetSterol O-acyltransferase 1(Rattus norvegicus)
Warner-Lambert
Curated by ChEMBL
LigandPNGBDBM50050243(CHEMBL21586 | N'-[2,6-Bis(1-methylethyl)phenyl]-N-...)
Affinity DataIC50:  2.50E+3nM. Assay description: In vitro inhibitory activity against acyl coenzyme A:cholesterol acyltransferase 1 in microsomes of rat liver
In DepthDetails ArticlePubMed