BDBM50050370 6-Benzyloxy-2,2-dimethyl-hexanoic acid (2,2,4,6-tetramethyl-2,3-dihydro-benzofuran-7-yl)-amide::CHEMBL282071
SMILES Cc1cc(C)c(NC(=O)C(C)(C)CCCCOCc2ccccc2)c2OC(C)(C)Cc12
InChI Key InChIKey=ORBPNJFIWAPTMG-UHFFFAOYSA-N
Data  1 IC50
  Tab Delimited (TSV)   2D SDfile   Computed 3D by Vconf -m prep SDfile
Find this compound or compounds like it in BindingDB:
Activity Spreadsheet -- Enzyme Inhibition Constant Data from BindingDB
Found 1 hit for monomerid = 50050370
TargetAcyl-CoA:cholesterol acyltransferase(Oryctolagus cuniculus)
Institute For Bio-Medical Research
Curated by ChEMBL
LigandPNGBDBM50050370(6-Benzyloxy-2,2-dimethyl-hexanoic acid (2,2,4,6-te...)
Affinity DataIC50:  400nM. Assay description: Inhibitory activity against Acyl coenzyme A:cholesterol acyltransferase 1 obtained from rabbit intestine microsomes
In DepthDetails ArticlePubMed