BDBM50050502 CHEMBL3317851
SMILES COc1ccc(OC)c(c1)C(=O)Nc1cccc(NC(=O)c2cccc(C)c2)c1
InChI Key InChIKey=YWXSEZVUTCEGSS-UHFFFAOYSA-N
Data  2 IC50
  Tab Delimited (TSV)   2D SDfile   Computed 3D by Vconf -m prep SDfile
Find this compound or compounds like it in BindingDB:
Activity Spreadsheet -- Enzyme Inhibition Constant Data from BindingDB
Found 2 hits for monomerid = 50050502
TargetPotassium channel subfamily K member 9(Homo sapiens (Human))
University Of Kansas Specialized Chemistry Center
Curated by ChEMBL
LigandPNGBDBM50050502(CHEMBL3317851)
Affinity DataIC50:  2.30E+3nM. Assay description: Inhibition of TASK-3 (unknown origin) expressed in CHO cells by thallium flux assay
In DepthDetails ArticlePubMed
TargetPotassium channel subfamily K member 3(Homo sapiens (Human))
University Of Kansas Specialized Chemistry Center
Curated by ChEMBL
LigandPNGBDBM50050502(CHEMBL3317851)
Affinity DataIC50:  150nM. Assay description: Inhibition of TASK-1 (unknown origin) expressed in CHO cells by thallium flux assay
In DepthDetails ArticlePubMed