BDBM50050529 (S)-1-[2-((5R,7R)-2,6-Dioxo-1,7-diaza-spiro[4.4]non-7-yl)-3-phenyl-propionyl]-pyrrolidine-2-carboxylic acid amide
SMILES NC(=O)[C@@H]1CCCN1C(=O)C(Cc1ccccc1)N1CC[C@]2(CCC(=O)N2)C1=O
InChI Key InChIKey=AVSGKJVHEXVAHZ-VTBIZFIGSA-N
Data  1 KI  1 EC50
  Tab Delimited (TSV)   2D SDfile   Computed 3D by Vconf -m prep SDfile
Find this compound or compounds like it in BindingDB:
Activity Spreadsheet -- Enzyme Inhibition Constant Data from BindingDB
Found 2 hits for monomerid = 50050529
TargetThyrotropin-releasing hormone receptor(MOUSE)
Washington University
Curated by ChEMBL
LigandPNGBDBM50050529((S)-1-[2-((5R,7R)-2,6-Dioxo-1,7-diaza-spiro[4.4]no...)
Affinity DataKi:  4.40E+3nM. Assay description: Binding affinity against TRH-R receptor in AtT-20 mouse pituitary tumor cells
In DepthDetails ArticlePubMed
TargetThyrotropin-releasing hormone receptor(MOUSE)
Washington University
Curated by ChEMBL
LigandPNGBDBM50050529((S)-1-[2-((5R,7R)-2,6-Dioxo-1,7-diaza-spiro[4.4]no...)
Affinity DataEC50:  290nM. Assay description: Effective concentration required to activate TRH-R receptor in AtT-20 mouse pituitary tumor cells
In DepthDetails ArticlePubMed